Project faust-gradle

Dieser Build lässt alle Schritte laufen, um die Faustedition zu bauen und zu deployen. Lediglich die Suche wird noch nicht aktualisiert.

Disk Usage Trend
Disk Usage Trend
 Console output
Snip! (Full log)
SEVERE: Could not send response to the client
SEVERE: Could not send response to the client
SEVERE: Could not send response to the client
SEVERE: Could not send response to the client
SEVERE: Could not send response to the client
WARNING: Conversion to SVG for 2 III H.52 issued messages:
2 III H.52 2 ERR Error: <g> attribute transform: Trailing garbage, "translate(0, -null)".
SEVERE: Could not send response to the client
WARNING: Conversion to SVG for 2 III H.3a:1 issued messages:
2 III H.3a:1 10 ERR Error: <g> attribute transform: Trailing garbage, "translate(0, -null)".
2 III H.3a:1 16 ERR Error: <g> attribute transform: Trailing garbage, "translate(0, -null)".
2 III H.3a:1 26 ERR Error: <g> attribute transform: Trailing garbage, "translate(0, -null)".
INFO: No transcripts for B.a, skipping
INFO: No transcripts for C.2α 4, skipping
INFO: No transcripts for C.1 12, skipping
INFO: No transcripts for J.1, skipping
INFO: No transcripts for S, skipping
INFO: No transcripts for J.3-2, skipping
INFO: No transcripts for D.2, skipping
INFO: No transcripts for D.1, skipping
INFO: No transcripts for C.3 4, skipping
INFO: No transcripts for B, skipping
INFO: No transcripts for D.4alpha, skipping
INFO: No transcripts for C.3 12, skipping
INFO: No transcripts for J.2, skipping
INFO: No transcripts for A, skipping
INFO: No transcripts for C.1 4, skipping
WARNING: Conversion to SVG for 2 IV H.1 issued messages:
2 IV H.1 2 ERR Error: <g> attribute transform: Trailing garbage, "translate(0, -null)".
SEVERE: Could not send response to the client
SEVERE: Could not send response to the client
SEVERE: Could not send response to the client
WARNING: Conversion to SVG for 2 II H.74 issued messages:
2 II H.74 6 ERR Error: <g> attribute transform: Trailing garbage, "translate(0, -null)".
2 II H.74 33 ERR Error: <g> attribute transform: Trailing garbage, "translate(0, -null)".
SEVERE: 27 documents failed to convert: 1 H.1, J.3-1, 2 I H.9e*, 2 I H.9i*, 2 V H.35a*, 2 I H.9n*, 2 I H.9p*, 2 I H.9c*, H P156a*, 2 III H.81b*, T 6 H.1, T 6 H.2, B.a, C.2α 4, C.1 12, J.1, S, J.3-2, D.2, D.1, C.3 4, B, D.4alpha, C.3 12, J.2, A, C.1 4

FAILURE: Build failed with an exception.

* Where:
Build file '/mnt/data/jenkins/work/work/workspace/faust-gradle/macrogen/build.gradle' line: 130

* What went wrong:
Execution failed for task ':macrogen:runMacrogenAnalysis'.
> Process 'command '/mnt/data/jenkins/work/work/workspace/faust-gradle/build/envs/macrogen/bin/macrogen'' finished with non-zero exit value 1

* Try:
> Run with --stacktrace option to get the stack trace.
> Run with --info or --debug option to get more log output.
> Run with --scan to get full insights.

* Get more help at https://help.gradle.org

Deprecated Gradle features were used in this build, making it incompatible with Gradle 8.0.

You can use '--warning-mode all' to show the individual deprecation warnings and determine if they come from your own scripts or plugins.

See https://docs.gradle.org/7.5.1/userguide/command_line_interface.html#sec:command_line_warnings

Execution optimizations have been disabled for 1 invalid unit(s) of work during this build to ensure correctness.
Please consult deprecation warnings for more details.

BUILD FAILED in 15m 45s
17 actionable tasks: 14 executed, 3 up-to-date
Build step 'Invoke Gradle script' changed build result to FAILURE
Build step 'Invoke Gradle script' marked build as failure
$ ssh-agent -k
unset SSH_AUTH_SOCK;
unset SSH_AGENT_PID;
echo Agent pid 14948 killed;
[ssh-agent] Stopped.
Archiving artifacts
[Set GitHub commit status (universal)] PENDING on repos [] (sha:dcb7ef1) with context:faust-gradle
Started calculate disk usage of build
Finished Calculation of disk usage of build in 0 seconds
Started calculate disk usage of workspace
Finished Calculation of disk usage of workspace in 0 seconds
Notifying upstream projects of job completion
Finished: FAILURE
Last Successful Artifacts
faust-dev.xar8.67 MB view

Identified problems

No identified problem

No problems were identified. If you know why this problem occurred, please add a suitable Cause for it.

Disk Usage
Directory iconJob61 MB
Directory iconAll builds61 MB
Directory iconLocked builds-
Directory iconAll workspaces7 GB
Directory iconSlave workspaces7 GB
Directory iconNon-slave workspaces-

Upstream Projects